Main menu

Navigation

case.build error at buildlib.csm_share FAILED

5 posts / 0 new
Last post
lss_880211@...
case.build error at buildlib.csm_share FAILED

Dear all,

I am trying to run CESM2.0 on Canada Super computer Niagara, using the composet FXSD and f19_f19 resolution. The build error is shown below and I also attached the csm_share.bldlog. Any help is much appreciated.

xiaoshi@nia-login05:/scratch/y/yochen/xiaoshi/cesm/cases/fxsd$ ./case.build

Building case in directory /gpfs/fs0/scratch/y/yochen/xiaoshi/cesm/cases/fxsd

sharedlib_only is False

model_only is False

Generating component namelists as part of build

Creating component namelists

   Calling /gpfs/fs0/scratch/y/yochen/xiaoshi/cesm/my_cesm_sandbox/components/cam//cime_config/buildnml

     ...calling cam buildcpp to set build time options

CAM namelist copy: file1 /scratch/y/yochen/xiaoshi/cesm/cases/fxsd/Buildconf/camconf/atm_in file2 /scratch/y/yochen/xiaoshi/cesm/output/

   Calling /gpfs/fs0/scratch/y/yochen/xiaoshi/cesm/my_cesm_sandbox/components/clm//cime_config/buildnml

     ...calling clm buildcpp to set build time options

   Calling /gpfs/fs0/scratch/y/yochen/xiaoshi/cesm/my_cesm_sandbox/components/cice//cime_config/buildnml

     ...calling cice buildcpp to set build time options

File not found: grid_file = "/scratch/y/yochen/xiaoshi/cesm/input/share/domains/domain.ocn.1.9x2.5_gx1v6_090403.nc", will attempt to dowt_data phase

File not found: kmt_file = "/scratch/y/yochen/xiaoshi/cesm/input/share/domains/domain.ocn.1.9x2.5_gx1v6_090403.nc", will attempt to down_data phase

   Calling /gpfs/fs0/scratch/y/yochen/xiaoshi/cesm/my_cesm_sandbox/cime/src/components/data_comps/docn/cime_config/buildnml

File not found: domainfile = "/scratch/y/yochen/xiaoshi/cesm/input/share/domains/domain.ocn.1.9x2.5_gx1v6_090403.nc", will attempt to dout_data phase

   Calling /gpfs/fs0/scratch/y/yochen/xiaoshi/cesm/my_cesm_sandbox/components/rtm//cime_config/buildnml

File not found: frivinp_rtm = "/scratch/y/yochen/xiaoshi/cesm/input/lnd/clm2/rtmdata/rdirc_0.5x0.5_simyr2000_slpmxvl_c120717.nc", will ain check_input_data phase

File not found: finidat_rtm = "/scratch/y/yochen/xiaoshi/cesm/input/rof/rtm/initdata/rtmi.ICRUCLM45BGC.2000-01-01.R05_simyr2000_c130518.o download in check_input_data phase

   Calling /gpfs/fs0/scratch/y/yochen/xiaoshi/cesm/my_cesm_sandbox/cime/src/components/stub_comps/sglc/cime_config/buildnml

   Calling /gpfs/fs0/scratch/y/yochen/xiaoshi/cesm/my_cesm_sandbox/cime/src/components/stub_comps/swav/cime_config/buildnml

   Calling /gpfs/fs0/scratch/y/yochen/xiaoshi/cesm/my_cesm_sandbox/cime/src/components/stub_comps/sesp/cime_config/buildnml

   Calling /gpfs/fs0/scratch/y/yochen/xiaoshi/cesm/my_cesm_sandbox/cime/src/drivers/mct/cime_config/buildnml

   NOTE: ignoring setting of rof2ocn_liq_rmapname=idmap in seq_maps.rc

   NOTE: ignoring setting of rof2ocn_ice_rmapname=idmap in seq_maps.rc

   NOTE: ignoring setting of rof2ocn_fmapname=idmap in seq_maps.rc

Finished creating component namelists

Building gptl with output to file /scratch/y/yochen/xiaoshi/cesm/output/fxsd/bld/gptl.bldlog.181120-100037

   Calling /gpfs/fs0/scratch/y/yochen/xiaoshi/cesm/my_cesm_sandbox/cime/src/build_scripts/buildlib.gptl

Component gptl build complete with 1 warnings

Building mct with output to file /scratch/y/yochen/xiaoshi/cesm/output/fxsd/bld/mct.bldlog.181120-100037

   Calling /gpfs/fs0/scratch/y/yochen/xiaoshi/cesm/my_cesm_sandbox/cime/src/build_scripts/buildlib.mct

Building pio with output to file /scratch/y/yochen/xiaoshi/cesm/output/fxsd/bld/pio.bldlog.181120-100037

   Calling /gpfs/fs0/scratch/y/yochen/xiaoshi/cesm/my_cesm_sandbox/cime/src/build_scripts/buildlib.pio

Component pio build complete with 5 warnings

Building csm_share with output to file /scratch/y/yochen/xiaoshi/cesm/output/fxsd/bld/csm_share.bldlog.181120-100037

   Calling /gpfs/fs0/scratch/y/yochen/xiaoshi/cesm/my_cesm_sandbox/cime/src/build_scripts/buildlib.csm_share

ERROR: /gpfs/fs0/scratch/y/yochen/xiaoshi/cesm/my_cesm_sandbox/cime/src/build_scripts/buildlib.csm_share FAILED, cat /scratch/y/yochen/xfxsd/bld/csm_share.bldlog.181120-100037

jedwards

No bldlog attached (try adding .txt to the bldlog filename).   Also let us know what compiler and version you are using.  

lss_880211@...

Hi,

I attached the csm_share.bldlog.txt. I use intel/2018.3 compiler

Attachment: 
jedwards

The compset you have selected requires that the ESMF library be avalible.  We do not provide that library, you will need to download and install it.

https://www.earthsystemcog.org/projects/esmf/download/

dqht06@...

Dear all,

I also encountered a case.build error at buildlib.csm_share. The error messages in the csm_share.bldlog is as follows:

 

/HOME/HDQ/mysandbox/cime/src/share/util/shr_infnan_mod.F90.in(72): error #7950: Procedure name in MODULE PROCEDURE statement must be the name of accessible module procedure.   [SHR_INFNAN_ISNAN_DOUBLE]

 

   module procedure shr_infnan_isnan_double

 

--------------------^

 

/HOME/HDQ/mysandbox/cime/src/share/util/shr_infnan_mod.F90.in(74): error #7950: Procedure name in MODULE PROCEDURE statement must be the name of accessible module procedure.   [SHR_INFNAN_ISNAN_REAL]

 

   module procedure shr_infnan_isnan_real

 

--------------------^

 

/HOME/HDQ/mysandbox/cime/src/share/util/shr_infnan_mod.F90.in(72): error #7407: Unresolved MODULE PROCEDURE specification name.   [SHR_INFNAN_ISNAN_DOUBLE]

 

   module procedure shr_infnan_isnan_double

 

--------------------^

 

/HOME/HDQ/mysandbox/cime/src/share/util/shr_infnan_mod.F90.in(74): error #7407: Unresolved MODULE PROCEDURE specification name.   [SHR_INFNAN_ISNAN_REAL]

 

   module procedure shr_infnan_isnan_real

 

--------------------^

 

compilation aborted for shr_infnan_mod.F90 (code 1)

 

make: *** [shr_infnan_mod.o] Error 1

 

make: *** Waiting for unfinished jobs....

 

I use intel 15.0.1 compiler and Python 2.7.10. Can anyone on here offer any help?

I really appreciate your help!

Log in or register to post comments

Who's new

  • zweina@...
  • yuan.liang@...
  • lian.xue@...
  • 353482168@...
  • 76414461@...