Main menu

Navigation

Error building SCAM

1 post / 0 new
benstephens@...
Error building SCAM

I'm currently trying to build the single-column model (SCAM), and the build process goes (mostly) okay until I get this series of messages:

 

make[1]: Entering directory `/disk/cg6/ccoda/code/proj/abrupt/exp/cam1/models/atm/cam/tools/scam/ui'

g++ -c -Wall -g -DLINUX -DREAL_TYPE=double -DNeedFuncProto   -I/disk/cg6/ccoda/code/proj/abrupt/exp/cam1/models/atm/cam/tools/scam/ui -I/disk/cg6/ccoda/code/proj/abrupt/exp/cam1/models/atm/cam/tools/scam/scm_init -I/usr/local/climate/netcdf/include -I/usr/lib64/qt-3.3/include -I. -I/usr/local/climate/NCL2014/RH6/include ChangeAxisScaleDlgImpl.moc.cpp

In file included from model.h:10,

                 from manager.h:15,

                 from plot.h:18,

                 from ChangeAxisScaleDlgImpl.h:5,

                 from ChangeAxisScaleDlgImpl.moc.cpp:11:

ascii_dataset.h:18: error: extra qualification ‘Ascii_Dataset::’ on member ‘Ascii_Dataset’

make[1]: *** [ChangeAxisScaleDlgImpl.moc.o] Error 1

make[1]: Leaving directory `/disk/cg6/ccoda/code/proj/abrupt/exp/cam1/models/atm/cam/tools/scam/ui'

 

make: *** [all] Error 2



Has anyone here tried to build SCAM before or got any idea what I can do to resolve this?

Thanks.

Who's new

  • alessandro.delo...
  • zweina@...
  • yuan.liang@...
  • lian.xue@...
  • 353482168@...